Target
Mast/stem cell growth factor receptor Kit [544-976]
Ligand
BDBM239042
Substrate
BioDB n*138 SEQ ID NO: 2
Meas. Tech.
Biochemical Assay
pH
7.9±n/a
IC50
55±n/a nM
Comments
extracted
Citation
 Lombardi Borgia, ACiomei, MDonati, DNesi, M Substituted indazole derivatives active as kinase inhibitors US Patent  US9408850 Publication Date 8/9/2016 
Target
Name:
Mast/stem cell growth factor receptor Kit [544-976]
Synonyms:
KIT SCFR | Tyrosine-protein kinase Kit
Type:
Protein
Mol. Mass.:
48998.23
Organism:
Homo sapiens (Human)
Description:
aa 544-976
Residue:
433
  
Inhibitor
Name:
BDBM239042
Synonyms:
US10028934, Compound 42 US9408850, 42 | US9597317, 42
Type:
Small organic molecule
Emp. Form.:
C29H30F3N5O4
Mol. Mass.:
569.5748
SMILES:
C[N+]1([O-])CCN(CC1)c1ccc(cc1)C(=O)Nc1n[nH]c2cc(OCCOCc3ccc(cc3)C(F)(F)F)ccc12
:
Substrate
Name:
BioDB n*138 SEQ ID NO: 2
Synonyms:
Type:
Peptide Substrate
Mol. Mass.:
3822.64
Organism:
Artificial Organism
Description:
SEQ ID NO: 2
Residue:
30