Target
Histone deacetylase 4
Ligand
BDBM293877
Substrate
Meas. Tech.
Biochemical HDAC-4 Assay
IC50
230±n/a nM
Citation
 Dominguez, CMuñoz-Sanjuán, IMaillard, MLuckhurst, CAJarvis, REBürli, RWAllen, DRHaughan, AFBreccia, PVater, HDStott, AJPenrose, SDWall, MSaville-Stones, EAWishart, GHughes, SJ Histone deacetylase inhibitors and compositions and methods of use thereof US Patent  US10106535 Publication Date 10/23/2018 
Target
Name:
Histone deacetylase 4
Synonyms:
Cereblon/Histone deacetylase 4 HDAC4 Histone acetylase 4(HDAC4) KIAA0288
Type:
Enzyme
Mol. Mass.:
119049.39
Organism:
Homo sapiens (Human)
Description:
P56524
Residue:
1084
  
Inhibitor
Name:
BDBM293877
Synonyms:
(R)-1-(3-Fluoro-2- methylphenyl)-N- hydroxy-3-(o- tolyl)cyclopent-2- enecarboxamide US9617259, 3
Type:
Small organic molecule
Emp. Form.:
C20H20FNO2
Mol. Mass.:
325.3767
SMILES:
Cc1ccccc1C1=C[C@@](CC1)(C(=O)NO)c1cccc(F)c1C
: