Target
Histone deacetylase 4
Ligand
BDBM293900
Substrate
Meas. Tech.
Biochemical HDAC-4 Assay
IC50
10.00±n/a nM
Citation
 Dominguez, CMuñoz-Sanjuán, IMaillard, MLuckhurst, CAJarvis, REBürli, RWAllen, DRHaughan, AFBreccia, PVater, HDStott, AJPenrose, SDWall, MSaville-Stones, EAWishart, GHughes, SJ Histone deacetylase inhibitors and compositions and methods of use thereof US Patent  US10106535 Publication Date 10/23/2018 
Target
Name:
Histone deacetylase 4
Synonyms:
Cereblon/Histone deacetylase 4 HDAC4 Histone acetylase 4(HDAC4) KIAA0288
Type:
Enzyme
Mol. Mass.:
119049.39
Organism:
Homo sapiens (Human)
Description:
P56524
Residue:
1084
  
Inhibitor
Name:
BDBM293900
Synonyms:
(S)-3-(5-Chloro-6- methylpyridin-3-yl)-1-(3- fluoro-2-methylphenyl)- N-hydroxycyclopent-2- enecarboxamide US9617259, 26
Type:
Small organic molecule
Emp. Form.:
C19H18ClFN2O2
Mol. Mass.:
360.81
SMILES:
Cc1ncc(cc1Cl)C1=C[C@](CC1)(C(=O)NO)c1cccc(F)c1C
: