Target
Histone deacetylase 4
Ligand
BDBM293905
Substrate
Meas. Tech.
Biochemical HDAC-4 Assay
IC50
8300±n/a nM
Citation
 Dominguez, CMuñoz-Sanjuán, IMaillard, MLuckhurst, CAJarvis, REBürli, RWAllen, DRHaughan, AFBreccia, PVater, HDStott, AJPenrose, SDWall, MSaville-Stones, EAWishart, GHughes, SJ Histone deacetylase inhibitors and compositions and methods of use thereof US Patent  US10106535 Publication Date 10/23/2018 
Target
Name:
Histone deacetylase 4
Synonyms:
Cereblon/Histone deacetylase 4 HDAC4 Histone acetylase 4(HDAC4) KIAA0288
Type:
Enzyme
Mol. Mass.:
119049.39
Organism:
Homo sapiens (Human)
Description:
P56524
Residue:
1084
  
Inhibitor
Name:
BDBM293905
Synonyms:
1-(2-Fluorophenyl)-N- hydroxycyclopent-3- enecarboxamide US9617259, 31
Type:
Small organic molecule
Emp. Form.:
C12H12FNO2
Mol. Mass.:
221.2276
SMILES:
ONC(=O)C1(CC=CC1)c1ccccc1F
: