Target
Histone deacetylase 4
Ligand
BDBM293909
Substrate
Meas. Tech.
Biochemical HDAC-4 Assay
IC50
340±n/a nM
Citation
 Dominguez, CMuñoz-Sanjuán, IMaillard, MLuckhurst, CAJarvis, REBürli, RWAllen, DRHaughan, AFBreccia, PVater, HDStott, AJPenrose, SDWall, MSaville-Stones, EAWishart, GHughes, SJ Histone deacetylase inhibitors and compositions and methods of use thereof US Patent  US10106535 Publication Date 10/23/2018 
Target
Name:
Histone deacetylase 4
Synonyms:
Cereblon/Histone deacetylase 4 HDAC4 Histone acetylase 4(HDAC4) KIAA0288
Type:
Enzyme
Mol. Mass.:
119049.39
Organism:
Homo sapiens (Human)
Description:
P56524
Residue:
1084
  
Inhibitor
Name:
BDBM293909
Synonyms:
(S)-3-(5-Fluoropyridin-3- yl)-N-hydroxy-1- phenylcyclopent-2- enecarboxamide US9617259, 35
Type:
Small organic molecule
Emp. Form.:
C17H15FN2O2
Mol. Mass.:
298.3116
SMILES:
ONC(=O)[C@]1(CCC(=C1)c1cncc(F)c1)c1ccccc1
: