Target
Epidermal growth factor receptor
Ligand
BDBM50424972
Substrate
Meas. Tech.
Time-Resolved Fluorescence Assay
Temperature
298.15±n/a K
IC50
2170±n/a nM
Comments
extracted
Citation
 Ao, GNie, JLi, HMo, LChen, LSong, HChen, S Alpha-(3,5-dimethoxybenzylidene)-alpha′-hydrocarbyl methylene cyclic ketone and preparation method thereof US Patent  US9409845 Publication Date 8/9/2016 
Target
Name:
Epidermal growth factor receptor
Synonyms:
EGF Receptor Substrate EGFR_HUMAN ERBB1 Epidermal Growth Factor Receptor erbB-1 Epidermal growth factor receptor (EGFR) HER1 Proto-oncogene c-ErbB-1 Tyrosine-Protein Kinase ErbB-1
Type:
Receptor Kinase Domain
Mol. Mass.:
134279.59
Organism:
Homo sapiens (Human)
Description:
P00533
Residue:
1210
  
Inhibitor
Name:
BDBM50424972
Synonyms:
CHEMBL2316143 | US9409845, Table 1, Compound 4: (2E,6E)-2-(3,5-dimethoxybenzylidene)-6-(2-fluorobenzylidene)cyclohexanone
Type:
Small organic molecule
Emp. Form.:
C22H21FO3
Mol. Mass.:
352.3987
SMILES:
COc1cc(OC)cc(\C=C2/CCC\C(=C/c3ccccc3F)C2=O)c1
: