Target
Rho-associated protein kinase 2 [1-552]
Ligand
BDBM50382691
Substrate
Meas. Tech.
FRET-Based Enzyme-Coupled Assay
pH
7.5±n/a
Temperature
298.15±n/a K
IC50
1500±400 nM
Comments
extracted
Citation
 Schonbrunn, ELi, RSebti, SM Inhibitors of rho associated protein kinases (ROCK) and methods of use US Patent  US9409868 Publication Date 8/9/2016 
Target
Name:
Rho-associated protein kinase 2 [1-552]
Synonyms:
KIAA0619 ROCK2_HUMAN | Rho-associated protein kinase 2 (ROCK2)
Type:
Enzyme
Mol. Mass.:
63353.50
Organism:
Homo sapiens (Human)
Description:
aa 1-552
Residue:
552
  
Inhibitor
Name:
BDBM50382691
Synonyms:
CHEMBL2023151 | US9409868, 15
Type:
Small organic molecule
Emp. Form.:
C16H16N4O2
Mol. Mass.:
296.3238
SMILES:
OC(CNC(=O)Nc1ccc2[nH]ncc2c1)c1ccccc1
: