Target
Rho-associated protein kinase 2 [1-552]
Ligand
BDBM50382690
Substrate
Meas. Tech.
FRET-Based Enzyme-Coupled Assay
pH
7.5±n/a
Temperature
298.15±n/a K
IC50
5360±940 nM
Comments
extracted
Citation
 Schonbrunn, ELi, RSebti, SM Inhibitors of rho associated protein kinases (ROCK) and methods of use US Patent  US9409868 Publication Date 8/9/2016 
Target
Name:
Rho-associated protein kinase 2 [1-552]
Synonyms:
KIAA0619 ROCK2_HUMAN | Rho-associated protein kinase 2 (ROCK2)
Type:
Enzyme
Mol. Mass.:
63353.50
Organism:
Homo sapiens (Human)
Description:
aa 1-552
Residue:
552
  
Inhibitor
Name:
BDBM50382690
Synonyms:
CHEMBL2023160 | US9409868, 26
Type:
Small organic molecule
Emp. Form.:
C21H21N3O2
Mol. Mass.:
347.4103
SMILES:
OC[C@@H](Cc1ccccc1)NC(=O)Nc1ccc(cc1)-c1ccncc1
: