Target
Protein kinase C delta type
Ligand
BDBM239072
Substrate
Meas. Tech.
Binding Assay
pH
7.4±n/a
EC50
1110±n/a nM
Comments
extracted
Citation
 Baran, PSFelding, JJin, YYeh, C 3-O-acyl-ingenol analogues US Patent  US9409931 Publication Date 8/9/2016 
Target
Name:
Protein kinase C delta type
Synonyms:
KPCD_HUMAN PKCD Protein Kinase C- delta nPKC-delta
Type:
Enzyme
Mol. Mass.:
77516.79
Organism:
Homo sapiens (Human)
Description:
The recombinant human PKC enzymes were produced using a baculovirus expression system in SF9 cells
Residue:
676
  
Inhibitor
Name:
BDBM239072
Synonyms:
US9409931, 5
Type:
Small organic molecule
Emp. Form.:
C28H40O4
Mol. Mass.:
440.6148
SMILES:
C[C@@H]1C[C@@H]2[C@H]([C@@H]3C=C(CO)C[C@@H]4[C@@H](OC(=O)C5(C)CCCCC5)C(C)=C[C@@]14C3=O)C2(C)C
: