Target
Leucine-rich repeat serine/threonine-protein kinase 2 [970-2527]
Ligand
BDBM239235
Substrate
Meas. Tech.
LanthaScreen™ Assay (Km ATP)
pH
8.5±n/a
Temperature
298.15±n/a K
IC50
1.3±n/a nM
Comments
extracted
Citation
 Miller, MBasu, KDeMong, DScott, JLi, WHarris, JStamford, APoirier, MTempest, P Compounds inhibiting leucine-rich repeat kinase enzyme activity US Patent  US9416126 Publication Date 8/16/2016 
Target
Name:
Leucine-rich repeat serine/threonine-protein kinase 2 [970-2527]
Synonyms:
LRRK2 Leucine-rich repeat kinase 2 (LRRK2 t-WT) PARK8
Type:
Protein
Mol. Mass.:
177317.56
Organism:
Homo sapiens (Human)
Description:
Human LRRK2 variant (970-2527aa)
Residue:
1558
  
Inhibitor
Name:
BDBM239235
Synonyms:
US9416126, D51
Type:
Small organic molecule
Emp. Form.:
C20H25FN6O
Mol. Mass.:
384.4505
SMILES:
CC(C)Oc1cc2c(n[nH]c2cc1F)-c1cc(ncn1)N1CCN(C)[C@H](C)C1
: