Target
Cannabinoid receptor 1
Ligand
BDBM239144
Substrate
Meas. Tech.
Cannabinoid Receptor Binding Assay
Ki
>1.0e+4±n/a nM
IC50
>1.0e+4±n/a nM
Citation
 Taher, ATKadry, HHAllarà, MDi Marzo, VAbadi, AHAbouzid, KA Synthesis and binding study of certain 6-arylalkanamides as molecular probes for cannabinoid receptor subtypes. J Enzyme Inhib Med Chem 28:436-9 (2013)  
Target
Name:
Cannabinoid receptor 1
Synonyms:
CANN6 CB-R CNR CNR1_HUMAN Cannabinoid receptor Cannabinoid receptor 1 (brain)
Type:
G Protein-Coupled Receptor (GPCR)
Mol. Mass.:
52868.96
Organism:
Homo sapiens (Human)
Description:
P21554
Residue:
472
  
Inhibitor
Name:
BDBM239144
Synonyms:
(E)-N-(4-Hydroxyphenyl)-4-oxo-6-p-tolylhex-5-enamide (3f)
Type:
Small organic molecule
Emp. Form.:
C19H19NO3
Mol. Mass.:
309.3591
SMILES:
Cc1ccc(\C=C\C(=O)CCC(=O)Nc2ccc(O)cc2)cc1
: