Target
Siderophore-binding protein
Ligand
BDBM239163
Substrate
Meas. Tech.
CA Inhibition Assay
pH
7.5±n/a
Temperature
298.15±n/a K
Ki
9.7e+2±n/a nM
Comments
extracted
Citation
 Maresca, AVullo, DScozzafava, AManole, GSupuran, CT Inhibition of the ß-class carbonic anhydrases from Mycobacterium tuberculosis with carboxylic acids. J Enzyme Inhib Med Chem 28:392-6 (2013)  
Target
Name:
Siderophore-binding protein
Synonyms:
β-Carbonic anhydrase 3 (CA 3)
Type:
Enzyme
Mol. Mass.:
17663.22
Organism:
Mycobacterium tuberculosis
Description:
Residue:
174
  
Inhibitor
Name:
BDBM239163
Synonyms:
4-Bromobenzoic acid (1)
Type:
Small organic molecule
Emp. Form.:
C7H5BrO2
Mol. Mass.:
201.017
SMILES:
OC(=O)c1ccc(Br)cc1
: