Target
Carbonic anhydrase 1
Ligand
BDBM239171
Substrate
BDBM237235
Meas. Tech.
Esterase Assay
pH
7.4±0
Temperature
298.15±0 K
Ki
6.8e+3±n/a nM
Citation
 Ekinci, DFidan, İDurdagi, SKaban, ſSupuran, CT Kinetic and in silico analysis of thiazolidin-based inhibitors of a-carbonic anhydrase isoenzymes. J Enzyme Inhib Med Chem 28:370-4 (2013)  
Target
Name:
Carbonic anhydrase 1
Synonyms:
CA-I CAB Carbonate dehydratase I Carbonic anhydrase 1 (CA I) Carbonic anhydrase 1 (Recombinant CA I) Carbonic anhydrase B Carbonic anhydrase I (CA I) Carbonic anhydrase I (CAI) Carbonic anhydrase isoenzyme I (hCA I) | hCA
Type:
Enzyme
Mol. Mass.:
28873.37
Organism:
Homo sapiens (Human)
Description:
P00915
Residue:
261
  
Inhibitor
Name:
BDBM239171
Synonyms:
Thiazolidin-based CA inhibitor, 1
Type:
Small organic molecule
Emp. Form.:
C13H12N2OS2
Mol. Mass.:
276.377
SMILES:
Cc1cccc(n1)N1C(SCC1=O)c1cccs1
:
Substrate
Name:
BDBM237235
Synonyms:
4-Nitrophenylacetate
Type:
Small organic molecule
Emp. Form.:
C8H7NO4
Mol. Mass.:
181.1455
SMILES:
OC(=O)Cc1ccc(cc1)[N+]([O-])=O
: