Target
cAMP and cAMP-inhibited cGMP 3',5'-cyclic phosphodiesterase 10A
Ligand
BDBM239737
Substrate
Meas. Tech.
Scintillation Proximity Assay
Temperature
298.15±n/a K
IC50
5.00±n/a nM
Comments
extracted
Citation
 Flohr, AGroebke Zbinden, KKuhn, BLerner, CRudolph, MSchaffhauser, H Triazolo compounds as PDE10 inhibitors US Patent  US9394311 Publication Date 7/19/2016 
Target
Name:
cAMP and cAMP-inhibited cGMP 3',5'-cyclic phosphodiesterase 10A
Synonyms:
3',5'-cyclic phosphodiesterase PDE10_HUMAN Phosphodiesterase 10A
Type:
Protein
Mol. Mass.:
88412.52
Organism:
Homo sapiens (Human)
Description:
Q9Y233
Residue:
779
  
Inhibitor
Name:
BDBM239737
Synonyms:
US9394311, 20
Type:
Small organic molecule
Emp. Form.:
C23H28N8O
Mol. Mass.:
432.5214
SMILES:
COc1ccc(Cn2nc(nc2CCc2nc3c(C)ncc(C)n3n2)N2CCCC2)cc1
: