Target
cAMP and cAMP-inhibited cGMP 3',5'-cyclic phosphodiesterase 10A
Ligand
BDBM239762
Substrate
Meas. Tech.
Scintillation Proximity Assay
Temperature
298.15±n/a K
IC50
58.83±n/a nM
Comments
extracted
Citation
 Flohr, AGroebke Zbinden, KKuhn, BLerner, CRudolph, MSchaffhauser, H Triazolo compounds as PDE10 inhibitors US Patent  US9394311 Publication Date 7/19/2016 
Target
Name:
cAMP and cAMP-inhibited cGMP 3',5'-cyclic phosphodiesterase 10A
Synonyms:
3',5'-cyclic phosphodiesterase PDE10_HUMAN Phosphodiesterase 10A
Type:
Protein
Mol. Mass.:
88412.52
Organism:
Homo sapiens (Human)
Description:
Q9Y233
Residue:
779
  
Inhibitor
Name:
BDBM239762
Synonyms:
US9394311, 45
Type:
Small organic molecule
Emp. Form.:
C16H22N8
Mol. Mass.:
326.3995
SMILES:
Cc1cc2nc(CCc3nc(nn3C)N3CCCC3)nn2c(C)n1
: