Target
cAMP and cAMP-inhibited cGMP 3',5'-cyclic phosphodiesterase 10A
Ligand
BDBM239791
Substrate
Meas. Tech.
Scintillation Proximity Assay
Temperature
298.15±n/a K
IC50
2.16±n/a nM
Comments
extracted
Citation
 Flohr, AGroebke Zbinden, KKuhn, BLerner, CRudolph, MSchaffhauser, H Triazolo compounds as PDE10 inhibitors US Patent  US9394311 Publication Date 7/19/2016 
Target
Name:
cAMP and cAMP-inhibited cGMP 3',5'-cyclic phosphodiesterase 10A
Synonyms:
3',5'-cyclic phosphodiesterase PDE10A Phosphodiesterase 10 (PDE10) | Phosphodiesterase 10A
Type:
Protein
Mol. Mass.:
88412.52
Organism:
Homo sapiens (Human)
Description:
Q9Y233
Residue:
1055
  
Inhibitor
Name:
BDBM239791
Synonyms:
Roche-Dataset for PDE10A, Compound 285 | US9394311, 74
Type:
Small organic molecule
Emp. Form.:
C17H19ClN8
Mol. Mass.:
370.839
SMILES:
Cc1c(cc(Cl)c2nc(CCc3nc(nn3C)N3CCCC3)nn12)C#N
: