Target
Nociceptin receptor
Ligand
BDBM239911
Substrate
Meas. Tech.
Binding Assay
pH
7.4±n/a
Ki
295±n/a nM
Comments
extracted
Citation
 Nolte, BSchröder, WLinz, KEnglberger, WSchick, HGraubaum, HBraun, BOzegowski, SBálint, JSonnenschein, H Substituted 4-aminocyclohexane derivatives US Patent  US9403767 Publication Date 8/2/2016 
Target
Name:
Nociceptin receptor
Synonyms:
KOR-3 Mu-type opioid receptor (Mu) Nociceptin Receptor (ORL1 Receptor) Nociceptin receptor (ORL-1) Nociceptin/Orphanin FQ, NOP receptor OPIATE ORL-1 OPRL1 protein ORL1 Opioid receptor like-1 Orphanin FQ receptor (ORL1) | P41146
Type:
G Protein-Coupled Receptor (GPCR)
Mol. Mass.:
40702.87
Organism:
Homo sapiens (Human)
Description:
P41146
Residue:
370
  
Inhibitor
Name:
BDBM239911
Synonyms:
US9403767, 76 | US9403767, 77
Type:
Small organic molecule
Emp. Form.:
C25H33N3
Mol. Mass.:
375.5496
SMILES:
CN(CC1(C)CCC(CC1)(N(C)C)c1ccccc1)c1c[nH]c2ccccc12
: