Target
Mu-type opioid receptor
Ligand
BDBM239923
Substrate
Meas. Tech.
Binding Assay
Temperature
298.15±n/a K
Ki
3730±n/a nM
Comments
extracted
Citation
 Nolte, BSchröder, WLinz, KEnglberger, WSchick, HGraubaum, HBraun, BOzegowski, SBálint, JSonnenschein, H Substituted 4-aminocyclohexane derivatives US Patent  US9403767 Publication Date 8/2/2016 
Target
Name:
Mu-type opioid receptor
Synonyms:
M-OR-1 MOR-1 MUOR1 Mu opiate receptor OPRM1 hMOP | mu-type opioid receptor isoform MOR-1
Type:
G Protein-Coupled Receptor (GPCR)
Mol. Mass.:
44789.51
Organism:
Homo sapiens (Human)
Description:
P35372
Residue:
400
  
Inhibitor
Name:
BDBM239923
Synonyms:
US9403767, 101 | US9403767, 102
Type:
Small organic molecule
Emp. Form.:
C26H34N4
Mol. Mass.:
402.575
SMILES:
CN(C)C1(CCC(CC1)(N(C)Cc1ccn(C)n1)c1ccccc1)c1ccccc1
: