Target
Tyrosine-protein kinase JAK2
Ligand
BDBM239958
Substrate
Meas. Tech.
Kinase Assay
pH
7±n/a
Temperature
298.15±n/a K
IC50
6±n/a nM
Comments
extracted
Citation
 Xi, NLi, MHu, HDai, W Substituted heteroaryl compounds and methods of use US Patent  US9403801 Publication Date 8/2/2016 
Target
Name:
Tyrosine-protein kinase JAK2
Synonyms:
JAK-2 JAK2_HUMAN Janus kinase 2 (JAK2) | Janus kinase 2 (a protein tyrosine kinase)
Type:
Protein
Mol. Mass.:
130684.68
Organism:
Homo sapiens (Human)
Description:
O60674
Residue:
1132
  
Inhibitor
Name:
BDBM239958
Synonyms:
US9403801, 22
Type:
Small organic molecule
Emp. Form.:
C19H23ClN8O
Mol. Mass.:
414.892
SMILES:
Cn1cc(Nc2ncc(Cl)c(NC3CCC4CN(CC4C3)C(=O)CC#N)n2)cn1
: