Target
Cannabinoid receptor 2
Ligand
BDBM239992
Substrate
Meas. Tech.
cAMP Assay
Temperature
310.15±n/a K
EC50
155.9±n/a nM
Comments
extracted
Citation
 Bissantz, CDhurwasulu, BGrether, UHazra, AHebeisen, PRoever, SRogers-Evans, M Pyrazine derivatives US Patent  US9403808 Publication Date 8/2/2016 
Target
Name:
Cannabinoid receptor 2
Synonyms:
CANNABINOID CB2 CB2 CB2B CNR2_HUMAN Cannabinoid CB2 receptor Cannabinoid receptor 2 (CB2R) | hCB2
Type:
G Protein-Coupled Receptor (GPCR)
Mol. Mass.:
39690.94
Organism:
Homo sapiens (Human)
Description:
P34972
Residue:
360
  
Inhibitor
Name:
BDBM239992
Synonyms:
US9403808, 3
Type:
Small organic molecule
Emp. Form.:
C21H20ClN5O2
Mol. Mass.:
409.869
SMILES:
Cc1nc(no1)C1(CCC1)NC(=O)c1cnc(C2CC2)c(n1)-c1cccc(Cl)c1
: