Target
Cannabinoid receptor 1
Ligand
BDBM240051
Substrate
Meas. Tech.
cAMP Assay
Temperature
310.15±n/a K
EC50
1648.4±n/a nM
Comments
extracted
Citation
 Bissantz, CDhurwasulu, BGrether, UHazra, AHebeisen, PRoever, SRogers-Evans, M Pyrazine derivatives US Patent  US9403808 Publication Date 8/2/2016 
Target
Name:
Cannabinoid receptor 1
Synonyms:
CANN6 CB-R CNR CNR1_HUMAN Cannabinoid receptor Cannabinoid receptor 1 (brain)
Type:
G Protein-Coupled Receptor (GPCR)
Mol. Mass.:
52868.96
Organism:
Homo sapiens (Human)
Description:
P21554
Residue:
472
  
Inhibitor
Name:
BDBM240051
Synonyms:
US9403808, 62
Type:
Small organic molecule
Emp. Form.:
C20H25N5O3
Mol. Mass.:
383.4442
SMILES:
Cc1nc(no1)C(C)(NC(=O)c1cnc(C2CC2)c(OCC2CC2)n1)C1CC1
: