Target
Cannabinoid receptor 1
Ligand
BDBM240091
Substrate
Meas. Tech.
cAMP Assay
Temperature
310.15±n/a K
EC50
>10000±n/a nM
Comments
extracted
Citation
 Bissantz, CDhurwasulu, BGrether, UHazra, AHebeisen, PRoever, SRogers-Evans, M Pyrazine derivatives US Patent  US9403808 Publication Date 8/2/2016 
Target
Name:
Cannabinoid receptor 1
Synonyms:
CANN6 CB-R CNR CNR1_HUMAN Cannabinoid receptor Cannabinoid receptor 1 (brain)
Type:
G Protein-Coupled Receptor (GPCR)
Mol. Mass.:
52868.96
Organism:
Homo sapiens (Human)
Description:
P21554
Residue:
472
  
Inhibitor
Name:
BDBM240091
Synonyms:
US9403808, 102
Type:
Small organic molecule
Emp. Form.:
C23H28F2N4O2
Mol. Mass.:
430.4908
SMILES:
CC(C)(CCc1ccccc1)NC(=O)c1cnc(N2CC(F)(F)C2)c(OCC2CC2)n1
: