Target
Cyclin-dependent kinase 2/G1/S-specific cyclin-E1
Ligand
BDBM162124
Substrate
Meas. Tech.
CDK2/CycE Kinase Assay
pH
7.5±n/a
Temperature
295.15±n/a K
IC50
>20000±n/a nM
Comments
extracted
Citation
 Bärfacker, LPrechtl, SSiemeister, GWengner, AMAckerstaff, JNowak-Reppel, KBader, BLienau, PStöckigt, DHeinrich, T Amino-substituted isothiazoles US Patent  US9682995 Publication Date 6/20/2017 
Target
Name:
Cyclin-dependent kinase 2/G1/S-specific cyclin-E1
Synonyms:
CDK2/CycE CDK2/E Cyclin-Dependent Kinase 2 (CDK2) Cyclin-dependent kinase 2/cyclin E1
Type:
Protein
Mol. Mass.:
Description:
Components:
This complex has 2 components.
Component 1
Name:
Cyclin-dependent kinase 2
Synonyms:
CDK2 CDK2_HUMAN Cell division protein kinase 2 Protein cereblon/Cyclin-dependent kinase 2 | p33 protein kinase
Type:
Enzyme Subunit
Mol. Mass.:
33938.17
Organism:
Homo sapiens (Human)
Description:
P24941
Residue:
298
  
Component 2
Name:
G1/S-specific cyclin-E1
Synonyms:
CCNE CCNE1_HUMAN
Type:
Enzyme Subunit
Mol. Mass.:
47073.17
Organism:
Homo sapiens (Human)
Description:
Residue:
410
  
Inhibitor
Name:
BDBM162124
Synonyms:
US9682995, 36
Type:
Small organic molecule
Emp. Form.:
C17H14N6O2S
Mol. Mass.:
366.397
SMILES:
COc1ccc(NC(=O)c2c(C)nsc2Nc2ncccc2C#N)cn1
: