Target
Calpain-1 catalytic subunit
Ligand
BDBM240245
Substrate
Meas. Tech.
Inhibition FRET Assay
pH
7.4±n/a
IC50
>1000±n/a nM
Comments
extracted
Citation
 Thatcher, GRSchiefer, ITArancio, OMauro, F Cysteine protease inhibitors and uses thereof US Patent  US9403843 Publication Date 8/2/2016 
Target
Name:
Calpain-1 catalytic subunit
Synonyms:
CAN1_HUMAN CAPN1 Calpain-1 (u-Calpain) Calpain1
Type:
Protein
Mol. Mass.:
81880.51
Organism:
Homo sapiens (Human)
Description:
Residue:
714
  
Inhibitor
Name:
BDBM240245
Synonyms:
US9403843, 70 | US9403843, 75
Type:
Small organic molecule
Emp. Form.:
C21H24FN3O5S
Mol. Mass.:
449.496
SMILES:
CCOC(=O)[C@H]1O[C@@H]1C(=O)N[C@@H](CC(C)C)C(=O)Nc1nc(cs1)-c1ccc(F)cc1
: