Target
Calpain-1 catalytic subunit
Ligand
BDBM240273
Substrate
Meas. Tech.
Inhibition FRET Assay
pH
7.4±n/a
IC50
300±n/a nM
Comments
extracted
Citation
 Thatcher, GRSchiefer, ITArancio, OMauro, F Cysteine protease inhibitors and uses thereof US Patent  US9403843 Publication Date 8/2/2016 
Target
Name:
Calpain-1 catalytic subunit
Synonyms:
CAN1_HUMAN CAPN1 Calpain-1 (u-Calpain) Calpain1
Type:
Protein
Mol. Mass.:
81880.51
Organism:
Homo sapiens (Human)
Description:
Residue:
714
  
Inhibitor
Name:
BDBM240273
Synonyms:
US9403843, 56
Type:
Small organic molecule
Emp. Form.:
C19H17N7O7S
Mol. Mass.:
487.446
SMILES:
OC(=O)[C@H]1O[C@@H]1C(=O)N[C@@H](Cc1cscn1)C(=O)NCc1cn(nn1)-c1ccc(cc1)[N+]([O-])=O
: