Target
Cannabinoid receptor 2
Ligand
BDBM240430
Substrate
Meas. Tech.
cAMP Assay
Temperature
310.15±n/a K
EC50
3.7±n/a nM
Comments
extracted
Citation
 Grether, UKimbara, ANettekoven, MRicklin, FRoever, SRogers-Evans, MRombach, DSchulz-Gasch, TWestphal, M Pyridine-2-amides useful as CB2 agonists US Patent  US9409866 Publication Date 8/9/2016 
Target
Name:
Cannabinoid receptor 2
Synonyms:
CANNABINOID CB2 CB2 CB2B CNR2_HUMAN Cannabinoid CB2 receptor Cannabinoid receptor 2 (CB2R) | hCB2
Type:
G Protein-Coupled Receptor (GPCR)
Mol. Mass.:
39690.94
Organism:
Homo sapiens (Human)
Description:
P34972
Residue:
360
  
Inhibitor
Name:
BDBM240430
Synonyms:
US9409866, 145 US9409866, 155
Type:
Small organic molecule
Emp. Form.:
C20H24F2N4O3
Mol. Mass.:
406.4264
SMILES:
Cc1nc(no1)C(C)(CC1CC1)NC(=O)c1cc(OCC(F)F)c(cn1)C1CC1
: