Target
Cannabinoid receptor 1
Ligand
BDBM240366
Substrate
Meas. Tech.
cAMP Assay
Temperature
310.15±n/a K
EC50
190±n/a nM
Comments
extracted
Citation
 Grether, UKimbara, ANettekoven, MRicklin, FRoever, SRogers-Evans, MRombach, DSchulz-Gasch, TWestphal, M Pyridine-2-amides useful as CB2 agonists US Patent  US9409866 Publication Date 8/9/2016 
Target
Name:
Cannabinoid receptor 1
Synonyms:
CANN6 CB-R CNR CNR1_HUMAN Cannabinoid receptor Cannabinoid receptor 1 (brain)
Type:
G Protein-Coupled Receptor (GPCR)
Mol. Mass.:
52868.96
Organism:
Homo sapiens (Human)
Description:
P21554
Residue:
472
  
Inhibitor
Name:
BDBM240366
Synonyms:
US9409866, 81
Type:
Small organic molecule
Emp. Form.:
C16H18ClF3N4O5S
Mol. Mass.:
470.851
SMILES:
C[C@H](Oc1cc(ncc1Cl)C(=O)NC(C)(CS(C)(=O)=O)c1noc(C)n1)C(F)(F)F
: