Target
Trace amine-associated receptor 1
Ligand
BDBM240682
Substrate
Meas. Tech.
Radioligand Binding (rat TAAR1)
pH
7.4±n/a
Ki
38.8±n/a nM
Comments
extracted
Citation
 Galley, GGhellamallah, CNorcross, RPflieger, P Triazole carboxamides and uses thereof US Patent  US9416127 Publication Date 8/16/2016 
Target
Name:
Trace amine-associated receptor 1
Synonyms:
TAAR1_RAT Taar1 Trace amine receptor 1 (TARR1) Trace amine-associated receptor 1 (TAAR1) Trar1
Type:
Enzyme
Mol. Mass.:
38034.73
Organism:
Rattus norvegicus (Rat)
Description:
Q923Y9
Residue:
332
  
Inhibitor
Name:
BDBM240682
Synonyms:
US9416127, 19
Type:
Small organic molecule
Emp. Form.:
C20H21N5O3
Mol. Mass.:
379.4124
SMILES:
COc1ccc(cc1)-n1cc(nn1)C(=O)Nc1ccc(cc1)[C@H]1CNCCO1
: