Target
Hepatocyte growth factor receptor
Ligand
BDBM240741
Substrate
Substrate
Meas. Tech.
Kinase Activity Assay (NADH Read-Out)
pH
7±n/a
Temperature
305.15±n/a K
IC50
21±n/a nM
Comments
extracted
Citation
 Michels, MFollmann, MVakalopoulos, AZimmermann, KTeusch, NLobell, MBierer, DEngel, KKissel, M Fluoro-substituted 3,5-dicyano-4-(1H-indazol-5-yl)-2,6-dimethyl-1,4-dihydropyridine derivatives and methods of use thereof US Patent  US9422263 Publication Date 8/23/2016 
Target
Name:
Hepatocyte growth factor receptor
Synonyms:
Hepatocyte growth factor receptor Hepatocyte growth factor receptor (c-MET) MET Met proto-oncogene (hepatocyte growth factor receptor) Tyrosine-protein kinase Met (c-Met) c-Met kinase
Type:
Protein
Mol. Mass.:
155559.73
Organism:
Homo sapiens (Human)
Description:
P08581
Residue:
1390
  
Inhibitor
Name:
BDBM240741
Synonyms:
US9422263, 30
Type:
Small organic molecule
Emp. Form.:
C19H17F2N5
Mol. Mass.:
353.3686
SMILES:
CCC(F)(F)C1=C(C#N)C(C(C#N)=C(C)N1)c1ccc2[nH]nc(C)c2c1
:
Substrate
Name:
Substrate
Synonyms:
Type:
Peptide
Mol. Mass.:
1596.80
Organism:
Homo sapiens (Human)
Description:
Substrate
Residue:
14
KKKSPGEYVNIEFG