Target
Prostaglandin F2-alpha receptor
Ligand
BDBM240744
Substrate
Meas. Tech.
Cell Based Assay
pH
7.4±n/a
Temperature
310.15±n/a K
EC50
350±n/a nM
Comments
extracted
Citation
 Martos, JLCarling, WRWoodward, DFWang, JWKangasmetsa, JJ Compounds act at multiple prostaglandin receptors giving a general anti-inflammatory response US Patent  US9422273 Publication Date 8/23/2016 
Target
Name:
Prostaglandin F2-alpha receptor
Synonyms:
PF2R_HUMAN PGF2 alpha receptor PTGFR Prostanoid FP receptor
Type:
Enzyme
Mol. Mass.:
40072.29
Organism:
Homo sapiens (Human)
Description:
P43088
Residue:
359
  
Inhibitor
Name:
BDBM240744
Synonyms:
US9422273, 12a
Type:
Small organic molecule
Emp. Form.:
C29H38F4N4O5S
Mol. Mass.:
630.694
SMILES:
Fc1ccc(CCC(=O)NS(=O)(=O)C(F)(F)F)c(CN2CCC[C@H]2c2nc(co2)C(=O)NCCCCC2CCCCC2)c1
: