Target
Prostaglandin D2 receptor
Ligand
BDBM240745
Substrate
Meas. Tech.
Cell Based Assay
pH
7.4±n/a
Temperature
310.15±n/a K
EC50
<1±n/a nM
Comments
extracted
Citation
 Martos, JLCarling, WRWoodward, DFWang, JWKangasmetsa, JJ Compounds act at multiple prostaglandin receptors giving a general anti-inflammatory response US Patent  US9422273 Publication Date 8/23/2016 
Target
Name:
Prostaglandin D2 receptor
Synonyms:
PD2R_HUMAN Prostaglandin D2 Prostanoid DP receptor
Type:
Enzyme
Mol. Mass.:
40288.87
Organism:
Homo sapiens (Human)
Description:
Q13258
Residue:
359
  
Inhibitor
Name:
BDBM240745
Synonyms:
US9422273, 12c
Type:
Small organic molecule
Emp. Form.:
C30H41F3N4O6S
Mol. Mass.:
642.73
SMILES:
COc1ccc(CCC(=O)NS(=O)(=O)C(F)(F)F)c(CN2CCC[C@H]2c2nc(co2)C(=O)NCCCCC2CCCCC2)c1
: