Target
Prostaglandin E2 receptor EP1 subtype
Ligand
BDBM240745
Substrate
Meas. Tech.
Cell Based Assay
pH
7.4±n/a
Temperature
310.15±n/a K
EC50
70±n/a nM
Comments
extracted
Citation
 Martos, JLCarling, WRWoodward, DFWang, JWKangasmetsa, JJ Compounds act at multiple prostaglandin receptors giving a general anti-inflammatory response US Patent  US9422273 Publication Date 8/23/2016 
Target
Name:
Prostaglandin E2 receptor EP1 subtype
Synonyms:
PE2R1_HUMAN PTGER1 Prostaglandin E2 receptor EP1 subtype Prostanoid EP1 receptor
Type:
Enzyme
Mol. Mass.:
41834.57
Organism:
Homo sapiens (Human)
Description:
P34995
Residue:
402
  
Inhibitor
Name:
BDBM240745
Synonyms:
US9422273, 12c
Type:
Small organic molecule
Emp. Form.:
C30H41F3N4O6S
Mol. Mass.:
642.73
SMILES:
COc1ccc(CCC(=O)NS(=O)(=O)C(F)(F)F)c(CN2CCC[C@H]2c2nc(co2)C(=O)NCCCCC2CCCCC2)c1
: