Target
Focal adhesion kinase 1
Ligand
BDBM240749
Substrate
Meas. Tech.
ULight-LANCE Assay
pH
7.5±n/a
Temperature
298.15±n/a K
IC50
<10000±n/a nM
Comments
extracted
Citation
 Sim, TBHah, JMChoi, HGHam, YJLee, JHPark, DSKim, H 2,4,7-substituted thieno[3,2-d]pyrimidine compounds as protein kinase inhibitors US Patent  US9422307 Publication Date 8/23/2016 
Target
Name:
Focal adhesion kinase 1
Synonyms:
FADK 1 FAK1 FLT4 Focal adhesion kinase (FAK) Focal adhesion kinase 1 (FAK) Focal adhesion kinase-related nonkinase PTK2 Protein-tyrosine kinase 2 p125FAK | pp125FAK
Type:
Tyrosine-protein kinase
Mol. Mass.:
119233.17
Organism:
Homo sapiens (Human)
Description:
Q05397
Residue:
1052
  
Inhibitor
Name:
BDBM240749
Synonyms:
US9422307, 3
Type:
Small organic molecule
Emp. Form.:
C25H26N6O2S
Mol. Mass.:
474.578
SMILES:
CNC(=O)c1cccc(c1)-c1csc2c(N)nc(Nc3ccc(cc3)N3CCC(O)CC3)nc12
: