Target
5'-AMP-activated protein kinase catalytic subunit alpha-1/subunit beta-1/subunit gamma-1
Ligand
BDBM240781
Substrate
Meas. Tech.
Activation Assay
pH
7±n/a
Temperature
298.15±n/a K
EC50
67±n/a nM
Comments
extracted
Citation
 Langkopf, EBlum, A Azabenzimidazole derivatives US Patent  US9422312 Publication Date 8/23/2016 
Target
Name:
5'-AMP-activated protein kinase catalytic subunit alpha-1/subunit beta-1/subunit gamma-1
Synonyms:
5'-AMP-activated protein kinase Complex 1 AMP-activated protein kinase (AMPK) alpha-1/beta-1/gamma-1 AMPK complex 1 (alpha-1,beta-1,gamma-1) Recombinant AMPK alpha1/beta1/gamma1 complex
Type:
Mol. Mass.:
Description:
Components:
This complex has 0 components.
Component 1
Name:
5'-AMP-activated protein kinase subunit beta-1
Synonyms:
5'-AMP-activated protein kinase subunit beta-1 AMP-activated protein kinase alpha-2/beta-1/gamma-3 AMPK subunit beta-1 PRKAB1
Type:
Mol. Mass.:
30380.94
Organism:
Homo sapiens (Human)
Description:
Q9Y478
Residue:
270
  
Component 2
Name:
5'-AMP-activated protein kinase subunit gamma-1
Synonyms:
5'-AMP-activated protein kinase subunit gamma-1 AMP-activated protein kinase, gamma-1 subunit AMPK gamma-1 AMPK subunit gamma-1 PRKAG1
Type:
Mol. Mass.:
37581.44
Organism:
Homo sapiens (Human)
Description:
P54619
Residue:
331
  
Component 3
Name:
5'-AMP-activated protein kinase catalytic subunit alpha-1
Synonyms:
AAPK1_HUMAN AMP-activated protein kinase alpha-1/beta-2/gamma-2 AMPK subunit alpha-1 AMPK1 PRKAA1 | Tau-protein kinase PRKAA1
Type:
Protein
Mol. Mass.:
64023.62
Organism:
Homo sapiens (Human)
Description:
Q13131
Residue:
559
  
Inhibitor
Name:
BDBM240781
Synonyms:
US9422312, 18
Type:
Small organic molecule
Emp. Form.:
C26H26ClN5O5S
Mol. Mass.:
556.033
SMILES:
CNS(=O)(=NC)c1ccc(cc1)-c1ccc(cc1)-c1nc2[nH]c(O[C@@H]3CO[C@@H]4[C@H](O)CO[C@H]34)nc2cc1Cl
: