Target
Estrogen receptor beta
Ligand
BDBM240788
Substrate
Meas. Tech.
Luciferase Assay
Temperature
310.15±n/a K
IC50
80±n/a nM
Comments
extracted
Citation
 Yarger, JGNye, SH 6-substituted demethyl-estradiol derivatives as selective ER-β agonists US Patent  US9422324 Publication Date 8/23/2016 
Target
Name:
Estrogen receptor beta
Synonyms:
ER-beta ESR2_HUMAN Estradiol receptor beta (ERβ) Estrogen receptor (ER beta) Estrogen receptor beta (ER beta) NR3A2 estrogen beta
Type:
Protein
Mol. Mass.:
59238.43
Organism:
Homo sapiens (Human)
Description:
Q92731
Residue:
530
  
Inhibitor
Name:
BDBM240788
Synonyms:
US9422324, B
Type:
Small organic molecule
Emp. Form.:
C20H28O3
Mol. Mass.:
316.4345
SMILES:
COC[C@@H]1CC2C3CC[C@H](O)[C@@]3(C)CCC2c2ccc(O)cc12
: