Target
Carbonic anhydrase
Ligand
BDBM50278315
Substrate
Meas. Tech.
CA Inhibition Assay
pH
7.5±n/a
Temperature
298.15±n/a K
Ki
610000±n/a nM
Comments
extracted
Citation
 Maresca, AVullo, DScozzafava, ASupuran, CT Inhibition of the alpha- and beta-carbonic anhydrases from the gastric pathogen Helycobacter pylori with anions. J Enzyme Inhib Med Chem 28:388-91 (2013)  
Target
Name:
Carbonic anhydrase
Synonyms:
β-Carbonic anhydrase (βCA)
Type:
Enzyme
Mol. Mass.:
25322.60
Organism:
Helicobacter pylori
Description:
Q08IJ2
Residue:
218
  
Inhibitor
Name:
BDBM50278315
Synonyms:
CHEMBL111016 | sodium pyrosulfate
Type:
Small organic molecule
Emp. Form.:
O7S2
Mol. Mass.:
176.127
SMILES:
[O-]S(=O)(=O)OS([O-])(=O)=O
: