Target
Carbonic anhydrase
Ligand
BDBM62319
Substrate
Meas. Tech.
CA Inhibition Assay
pH
7.5±n/a
Temperature
298.15±n/a K
Ki
680000±n/a nM
Comments
extracted
Citation
 Maresca, AVullo, DScozzafava, ASupuran, CT Inhibition of the alpha- and beta-carbonic anhydrases from the gastric pathogen Helycobacter pylori with anions. J Enzyme Inhib Med Chem 28:388-91 (2013)  
Target
Name:
Carbonic anhydrase
Synonyms:
β-Carbonic anhydrase (βCA)
Type:
Enzyme
Mol. Mass.:
25322.60
Organism:
Helicobacter pylori
Description:
Q08IJ2
Residue:
218
  
Inhibitor
Name:
BDBM62319
Synonyms:
borate (B4O7 2-) | tetraborate
Type:
Emp. Form.:
B4O7
Mol. Mass.:
155.241
SMILES:
[O-]B1OB2OB([O-])OB(O1)O2
: