Target
Genome polyprotein [2420-3010]
Ligand
BDBM240861
Substrate
Meas. Tech.
HCV Replicon Assay
pH
7.5±n/a
Temperature
300.15±n/a K
EC50
310±n/a nM
Comments
extracted
Citation
 Du, JSofia, MJ 2′-spiro-nucleosides and derivatives thereof useful for treating hepatitis C virus and dengue virus infections US Patent  US9394331 Publication Date 7/19/2016 
Target
Name:
Genome polyprotein [2420-3010]
Synonyms:
POLG_HCVCO RNA-directed RNA polymerase (NS5B)
Type:
Enzyme
Mol. Mass.:
65783.36
Organism:
Hepatitis C virus genotype 1b (isolate Con1) (HCV)
Description:
aa 2420-3010
Residue:
591
  
Inhibitor
Name:
BDBM240861
Synonyms:
US9394331, 123
Type:
Small organic molecule
Emp. Form.:
C31H39N6O9P
Mol. Mass.:
670.6499
SMILES:
COc1nc(N)nc2n(cnc12)C1OC(COP(=O)(N[C@@H](C)C(=O)OCC(C)(C)C)Oc2cccc3ccccc23)[C@@H](O)[C@]11CCO1
: