Target
Genome polyprotein [2420-3010]
Ligand
BDBM240870
Substrate
Meas. Tech.
HCV Replicon Assay
pH
7.5±n/a
Temperature
300.15±n/a K
EC50
>20000±n/a nM
Comments
extracted
Citation
 Du, JSofia, MJ 2′-spiro-nucleosides and derivatives thereof useful for treating hepatitis C virus and dengue virus infections US Patent  US9394331 Publication Date 7/19/2016 
Target
Name:
Genome polyprotein [2420-3010]
Synonyms:
POLG_HCVCO RNA-directed RNA polymerase (NS5B)
Type:
Enzyme
Mol. Mass.:
65783.36
Organism:
Hepatitis C virus genotype 1b (isolate Con1) (HCV)
Description:
aa 2420-3010
Residue:
591
  
Inhibitor
Name:
BDBM240870
Synonyms:
US9394331, 132
Type:
Small organic molecule
Emp. Form.:
C18H26N5O7P
Mol. Mass.:
455.4021
SMILES:
COc1nc(N)nc2n(cnc12)C1OC2COP(=O)(OCC(C)(C)C)O[C@H]2[C@]11CCO1
: