Target
E3 ubiquitin-protein ligase XIAP [241-356]
Ligand
BDBM240892
Substrate
Meas. Tech.
TR-FRET Assay
pH
7.5±n/a
Temperature
298.15±n/a K
IC50
572±n/a nM
Comments
extracted
Citation
 Mischke, SG Dimeric compounds US Patent  US9409888 Publication Date 8/9/2016 
Target
Name:
E3 ubiquitin-protein ligase XIAP [241-356]
Synonyms:
API3 BIRC4 E3 ubiquitin-protein ligase XIAP BIR-3 IAP3 X-linked inhibitor of apoptosis protein BIR3 domain (XIAP BIR-3) XIAP-BIR3 baculovirus IAP repeat 3 (BIR3) domain of XIAP
Type:
Protein Binding Domain
Mol. Mass.:
13276.62
Organism:
Homo sapiens (Human)
Description:
BIR3 of XIAP: RESIDUES 241-356.
Residue:
116
  
Inhibitor
Name:
BDBM240892
Synonyms:
US9409888, 19
Type:
Small organic molecule
Emp. Form.:
C56H54Br2N10O8
Mol. Mass.:
1154.898
SMILES:
CN[C@@H](C)C(=O)N[C@H]1CN(C(=O)c2cnc(cn2)C(=O)N2C[C@H](NC(=O)[C@H](C)NC)C(=O)N(Cc3c(OC)ccc4cc(Br)ccc34)c3ccccc23)c2ccccc2N(Cc2c(OC)ccc3cc(Br)ccc23)C1=O
: