Target
Prolyl hydroxylase EGLN2
Ligand
BDBM241082
Substrate
Meas. Tech.
HIF-PH Assay
pH
7.4±n/a
IC50
750±n/a nM
Comments
extracted
Citation
 Ho, WZhao, HDeng, SNg, DWright, LRWu, MZhou, XArend, MPFlippin, LA 4-hydroxy-isoquinoline compounds as HIF hydroxylase inhibitors US Patent  US9409892 Publication Date 8/9/2016 
Target
Name:
Prolyl hydroxylase EGLN2
Synonyms:
EGLN2 EIT6 Estrogen-induced tag 6 HIF-PH1 HPH-3 PHD1 Prolyl hydroxylase domain-containing protein 1 (PHD1)
Type:
Protein
Mol. Mass.:
43657.01
Organism:
Homo sapiens (Human)
Description:
Q96KS0
Residue:
407
  
Inhibitor
Name:
BDBM241082
Synonyms:
US9409892, 177
Type:
Small organic molecule
Emp. Form.:
C23H18FN3O5
Mol. Mass.:
435.4045
SMILES:
OC(=O)C(CNC(=O)c1nc(C#N)c2cc(Oc3ccccc3F)ccc2c1O)C1CC1
: