Target
Ectonucleotide pyrophosphatase/phosphodiesterase family member 2
Ligand
BDBM241114
Substrate
Meas. Tech.
Inhibition Assay
IC50
520±n/a nM
Citation
 Legrand, DMFurminger, VThomson, CHughes, ORStanley, E Autotaxin inhibitors US Patent  US9409895 Publication Date 8/9/2016 
Target
Name:
Ectonucleotide pyrophosphatase/phosphodiesterase family member 2
Synonyms:
ATX Autotaxin (ATX) ENPP2 Ectonucleotide Pyrophosphatase/Phosphodiesterase 2 (ENPP2) Extracellular lysophospholipase D PDNP2
Type:
Enzyme
Mol. Mass.:
99007.13
Organism:
Homo sapiens (Human)
Description:
Q13822
Residue:
863
  
Inhibitor
Name:
BDBM241114
Synonyms:
US9409895, 25 | US9630945, 25
Type:
Small organic molecule
Emp. Form.:
C20H24Cl2N4O4
Mol. Mass.:
455.335
SMILES:
CN(CCC1CCN(CC1)C(=O)OCc1cc(Cl)cc(Cl)c1)C(=O)c1cc(O)[nH]n1
: