Target
Ectonucleotide pyrophosphatase/phosphodiesterase family member 2
Ligand
BDBM241120
Substrate
Meas. Tech.
Inhibition Assay
IC50
387±n/a nM
Citation
 Legrand, DMFurminger, VThomson, CHughes, ORStanley, E Autotaxin inhibitors US Patent  US9409895 Publication Date 8/9/2016 
Target
Name:
Ectonucleotide pyrophosphatase/phosphodiesterase family member 2
Synonyms:
ATX Autotaxin (ATX) ENPP2 Ectonucleotide Pyrophosphatase/Phosphodiesterase 2 (ENPP2) Extracellular lysophospholipase D PDNP2
Type:
Enzyme
Mol. Mass.:
99007.13
Organism:
Homo sapiens (Human)
Description:
Q13822
Residue:
863
  
Inhibitor
Name:
BDBM241120
Synonyms:
US9409895, 31 | US9630945, 31
Type:
Small organic molecule
Emp. Form.:
C20H21Cl2N3O4
Mol. Mass.:
438.304
SMILES:
Clc1cc(Cl)cc(\C=C\C(=O)N2CCC(CCNC(=O)c3c[nH]c(=O)o3)CC2)c1
: