Target
Coagulation factor IX
Ligand
BDBM241399
Substrate
US9409908, pyroGlu-Pro-Arg-pNA
Meas. Tech.
In Vitro Assay
pH
7.4±n/a
Ki
0.04±n/a nM
Comments
extracted
Citation
 Yang, WCorte, JRGilligan, PJPinto, DJEwing, WRDilger, AKWang, YFang, TPabbisetty, KBSmith, II, LM Dihydropyridone p1 as factor XIa inhibitors US Patent  US9409908 Publication Date 8/9/2016 
Target
Name:
Coagulation factor IX
Synonyms:
Christmas factor Coagulation factor IX/VIII Coagulation factor IXa heavy chain F9 Factor IX Factor IXa (fIXa) Plasma thromboplastin component
Type:
Enzyme
Mol. Mass.:
51768.83
Organism:
Homo sapiens (Human)
Description:
P00740
Residue:
461
  
Inhibitor
Name:
BDBM241399
Synonyms:
US9409908, 31 | US9951071, Example 31
Type:
Small organic molecule
Emp. Form.:
C32H30ClF3N4O5
Mol. Mass.:
643.053
SMILES:
COC(=O)Nc1ccc-2c(NC(=O)[C@H](C)CCC[C@H](N3CCC(=CC3=O)c3c(F)c(Cl)ccc3OC(F)F)c3ccnc-2c3)c1
:
Substrate
Name:
BDBM13573
Synonyms:
(2S)-5-carbamimidamido-N-(4-nitrophenyl)-2-{[(2S)-1-{[(2S)-5-oxopyrrolidin-2-yl]carbonyl}pyrrolidin-2-yl]formamido}pentanamide hydrochloride Glu-Pro-Arg-pNA L-Pyroglutamyl-L-prolyl-L-arginine-p-Nitroaniline S-2366
Type:
Small organic molecule
Emp. Form.:
C22H30N8O6
Mol. Mass.:
502.5236
SMILES:
[#7]\[#6](-[#7])=[#7]/[#6]-[#6]-[#6]-[#6@H](-[#7]-[#6](=O)-[#6@@H]-1-[#6]-[#6]-[#6]-[#7]-1-[#6](=O)-[#6@@H]-1-[#6]-[#6]-[#6](=O)-[#7]-1)-[#6](=O)-[#7]-c1ccc(cc1)-[#7+](-[#8-])=O
: