Target
Plasma kallikrein
Ligand
BDBM241409
Substrate
BDBM241595
Meas. Tech.
In Vitro Assay
Temperature
298.15±n/a K
Ki
2±n/a nM
Citation
 Yang, WCorte, JRGilligan, PJPinto, DJEwing, WRDilger, AKWang, YFang, TPabbisetty, KBSmith, II, LM Dihydropyridone p1 as factor XIa inhibitors US Patent  US9409908 Publication Date 8/9/2016 
Target
Name:
Plasma kallikrein
Synonyms:
Fletcher factor KLKB1 Kallikrein Plasma kallikrein heavy chain Plasma prekallikrein
Type:
Protein
Mol. Mass.:
71391.16
Organism:
Homo sapiens (Human)
Description:
P03952
Residue:
638
  
Inhibitor
Name:
BDBM241409
Synonyms:
US9409908, 41 | US9951071, Example 41
Type:
Small organic molecule
Emp. Form.:
C33H31ClF2N6O4
Mol. Mass.:
649.087
SMILES:
COCc1nnc(Nc2ccc-3c(NC(=O)[C@H](C)CCC[C@H](N4CCC(=CC4=O)c4c(F)ccc(Cl)c4F)c4cc-3ccn4)c2)o1
:
Substrate
Name:
BDBM241595
Synonyms:
US9409908, H-(D)-Pro-Phe-Arg-pNA
Type:
Small organic molecule
Emp. Form.:
C26H34N8O5
Mol. Mass.:
538.5988
SMILES:
[#7]\[#6](-[#7])=[#7]/[#6]-[#6]-[#6]-[#6@H](-[#7]-[#6](=O)-[#6@H](-[#6]-c1ccccc1)-[#7]-[#6](=O)-[#6@H]-1-[#6]-[#6]-[#6]-[#7]-1)-[#6](=O)-[#7]-c1ccc(cc1)-[#7+](-[#8-])=O
: