Target
Transient receptor potential M8 protein
Ligand
BDBM241660
Substrate
Meas. Tech.
Functional Assay
Temperature
310.15±n/a K
IC50
56±n/a nM
Comments
extracted
Citation
 Player, MRCalvo, RChen, JMeegalla, SParks, DJParsons, WJBallentine, SBranum, S Substituted aza-bicyclic imidazole derivatives useful as TRPM8 receptor modulators US Patent  US9409915 Publication Date 8/9/2016 
Target
Name:
Transient receptor potential M8 protein
Synonyms:
Cold-menthol receptor (TRPM8) Transient receptor potential M8 protein Transient receptor potential melastatin subfamily, type 8 (TRPM8)
Type:
Enzyme
Mol. Mass.:
127589.43
Organism:
Canis lupus familiaris (Dog)
Description:
Q1A7N1
Residue:
1104
  
Inhibitor
Name:
BDBM241660
Synonyms:
US9409915, 50 | US9718820, Compound 50
Type:
Small organic molecule
Emp. Form.:
C28H33ClF3N7O
Mol. Mass.:
576.056
SMILES:
CN1CCN(CCOc2nc(cc3nc([nH]c23)-c2c(Cl)c(nn2C)C(C)(C)C)-c2ccccc2C(F)(F)F)CC1
: