Target
P2X purinoceptor 7
Ligand
BDBM241740
Substrate
Meas. Tech.
YO-PRO Assay
Temperature
310.15±n/a K
IC50
758±n/a nM
Comments
extracted
Citation
 Hilpert, KHubler, FKimmerlin, TRenneberg, DStamm, S Heterocyclic amide derivatives as P2X7 receptor antagonists US Patent  US9409917 Publication Date 8/9/2016 
Target
Name:
P2X purinoceptor 7
Synonyms:
ATP receptor P2RX7_HUMAN P2X purinoceptor 7 (P2X7) P2Z receptor | Purinergic receptor
Type:
Protein
Mol. Mass.:
68602.85
Organism:
Homo sapiens (Human)
Description:
Q99572
Residue:
595
  
Inhibitor
Name:
BDBM241740
Synonyms:
US9409917, 37
Type:
Small organic molecule
Emp. Form.:
C17H17ClN2O2
Mol. Mass.:
316.782
SMILES:
CN(Cc1ccc(Cl)cc1)C(=O)C1CCOc2ncccc12
: