Target
P2X purinoceptor 7
Ligand
BDBM241744
Substrate
Meas. Tech.
YO-PRO Assay
Temperature
310.15±n/a K
IC50
16.3±n/a nM
Comments
extracted
Citation
 Hilpert, KHubler, FKimmerlin, TRenneberg, DStamm, S Heterocyclic amide derivatives as P2X7 receptor antagonists US Patent  US9409917 Publication Date 8/9/2016 
Target
Name:
P2X purinoceptor 7
Synonyms:
ATP receptor P2RX7_HUMAN P2X purinoceptor 7 (P2X7) P2Z receptor | Purinergic receptor
Type:
Protein
Mol. Mass.:
68602.85
Organism:
Homo sapiens (Human)
Description:
Q99572
Residue:
595
  
Inhibitor
Name:
BDBM241744
Synonyms:
US9409917, 41
Type:
Small organic molecule
Emp. Form.:
C17H16Cl2N2O3
Mol. Mass.:
367.227
SMILES:
Cc1cc(Cl)cc(Cl)c1CNC(=O)C1CCOc2c1ccc[n+]2[O-]
: