Target
P2X purinoceptor 7
Ligand
BDBM241759
Substrate
Meas. Tech.
YO-PRO Assay
Temperature
310.15±n/a K
IC50
125±n/a nM
Comments
extracted
Citation
 Hilpert, KHubler, FKimmerlin, TRenneberg, DStamm, S Heterocyclic amide derivatives as P2X7 receptor antagonists US Patent  US9409917 Publication Date 8/9/2016 
Target
Name:
P2X purinoceptor 7
Synonyms:
ATP receptor P2RX7_HUMAN P2X purinoceptor 7 (P2X7) P2Z receptor | Purinergic receptor
Type:
Protein
Mol. Mass.:
68602.85
Organism:
Homo sapiens (Human)
Description:
Q99572
Residue:
595
  
Inhibitor
Name:
BDBM241759
Synonyms:
US9409917, 56
Type:
Small organic molecule
Emp. Form.:
C16H12ClN3O2
Mol. Mass.:
313.738
SMILES:
Clc1c(CNC(=O)C2COc3ncccc23)cccc1C#N
: