Target
Proto-oncogene tyrosine-protein kinase Src
Ligand
BDBM50379227
Substrate
Meas. Tech.
Kinase Assay
pH
7.5±n/a
Temperature
303.15±n/a K
IC50
23000±n/a nM
Comments
extracted
Citation
 Burnet, MWThaher, BAEhlert, JKubbutat, MSchaechtele, CTotzke, F Kinase modulators for the treatment of cancer US Patent  US9416123 Publication Date 8/16/2016 
Target
Name:
Proto-oncogene tyrosine-protein kinase Src
Synonyms:
Calmodulin/Proto-oncogene tyrosine-protein kinase Src Proto-oncogene c-Src SRC SRC_HUMAN V-src sarcoma (Schmidt-Ruppin A-2) viral oncogene homolog (avian) p60-Src | pp60c-src
Type:
Protein
Mol. Mass.:
59838.60
Organism:
Homo sapiens (Human)
Description:
P12931
Residue:
536
  
Inhibitor
Name:
BDBM50379227
Synonyms:
CHEMBL2011293 | US9416123, 7
Type:
Small organic molecule
Emp. Form.:
C20H14ClFN4
Mol. Mass.:
364.803
SMILES:
Nc1c(c(nn1-c1ccc(Cl)cc1)-c1ccncc1)-c1ccc(F)cc1
: